Reaction Details
TargetSolute carrier family 2, facilitated glucose transporter member 1
LigandBDBM50388391
Substrate/Competitorn/a
Meas. Tech.ChEMBL_829819 (CHEMBL2061377)
IC50 5000±n/a nM
Citation Wang, DChu, PCYang, CNYan, RChuang, YCKulp, SKChen, CS Development of a novel class of glucose transporter inhibitors. J Med Chem55:3827-36 (2012) 
 
Solute carrier family 2, facilitated glucose transporter member 1
Name:Solute carrier family 2, facilitated glucose transporter member 1
Type:Protein
Mol. Mass.:54091.71
Organism:Homo sapiens (Human)
Description:n/a
Residue:492
BDBM50388391
NameBDBM50388391
Synonyms:CHEMBL2057965
TypeSmall organic molecule
Emp. Form.C17H18F3NO3S
Mol. Mass.373.39
SMILESCCC(CC)CN1C(=O)S\C(=C/c2ccc(O)c(c2)C(F)(F)F)C1=O