Reaction Details
TargetGlucose-6-phosphate 1-dehydrogenase
LigandBDBM50388478
Substrate/Competitorn/a
Meas. Tech.ChEMBL_830111 (CHEMBL2061902)
IC50 12300±n/a nM
Citation Hamilton, NMDawson, MFairweather, EEHamilton, NSHitchin, JRJames, DIJones, SDJordan, AMLyons, AJSmall, HFThomson, GJWaddell, IDOgilvie, DJ Novel steroid inhibitors of glucose 6-phosphate dehydrogenase. J Med Chem55:4431-45 (2012) 
 
Glucose-6-phosphate 1-dehydrogenase
Name:Glucose-6-phosphate 1-dehydrogenase
Type:Enzyme
Mol. Mass.:59258.58
Organism:Homo sapiens (Human)
Description:P11413
Residue:515
BDBM50388478
NameBDBM50388478
Synonyms:CHEMBL2057971
TypeSmall organic molecule
Emp. Form.C21H34O3
Mol. Mass.334.4929
SMILESC[C@]12CC[C@H]3[C@@H](CC[C@H]4C[C@@H](O)CC[C@]34C)[C@@H]1CC[C@@H]2C(=O)CO