Reaction Details
TargetM-phase inducer phosphatase 2
LigandBDBM50388810
Substrate/Competitorn/a
Meas. Tech.ChEMBL_830916 (CHEMBL2065465)
IC50 5520±n/a nM
Citation Tsuchiya, AHirai, GKoyama, YOonuma, KOtani, YOsada, HSodeoka, M Dual-Specificity Phosphatase CDC25A/B Inhibitor Identified from a Focused Library with Nonelectrophilic Core Structure. ACS Med Chem Lett3:294-298 (2012) 
 
M-phase inducer phosphatase 2
Name:M-phase inducer phosphatase 2
Type:Protein
Mol. Mass.:64985.27
Organism:Homo sapiens (Human)
Description:n/a
Residue:580
BDBM50388810
NameBDBM50388810
Synonyms:CHEMBL2062598
TypeSmall organic molecule
Emp. Form.C28H42ClNO4
Mol. Mass.492.09
(NCc1ccc(Cl)cc1)=C1C(=O)OC(CO)C1=O