Reaction Details
TargetM-phase inducer phosphatase 1
LigandBDBM50388818
Substrate/Competitorn/a
Meas. Tech.ChEMBL_830930 (CHEMBL2065479)
IC50 5550±n/a nM
Citation Tsuchiya, AHirai, GKoyama, YOonuma, KOtani, YOsada, HSodeoka, M Dual-Specificity Phosphatase CDC25A/B Inhibitor Identified from a Focused Library with Nonelectrophilic Core Structure. ACS Med Chem Lett3:294-298 (2012) 
 
M-phase inducer phosphatase 1
Name:M-phase inducer phosphatase 1
Type:Protein
Mol. Mass.:59090.18
Organism:Homo sapiens (Human)
Description:P30304
Residue:524
BDBM50388818
NameBDBM50388818
Synonyms:CHEMBL2062712
TypeSmall organic molecule
Emp. Form.C28H43NO5
Mol. Mass.473.6447
(NCc1ccccc1O)=C1C(=O)OC(CO)C1=O