Reaction Details
TargetCalcitonin gene-related peptide type 1 receptor
LigandBDBM50184069
Substrate/Competitorn/a
Meas. Tech.ChEMBL_830950 (CHEMBL2065550)
Ki 0.01±n/a nM
Citation Luo, GChen, LConway, CMDenton, RKeavy, DGulianello, MHuang, YKostich, WLentz, KAMercer, SESchartman, RSignor, LBrowning, MMacor, JEDubowchik, GM Discovery of BMS-846372, a Potent and Orally Active Human CGRP Receptor Antagonist for the Treatment of Migraine. ACS Med Chem Lett3:337-341 (2012) 
 
Calcitonin gene-related peptide type 1 receptor
Name:Calcitonin gene-related peptide type 1 receptor
Type:Enzyme Catalytic Domain
Mol. Mass.:52980.45
Organism:Homo sapiens (Human)
Description:Q16602
Residue:461
BDBM50184069
NameBDBM50184069
Synonyms:CHEMBL207197 N-{(1S)-5-amino-1-[(4-pyridin-4-ylpiperazin-1-yl)carbonyl]pentyl}-3,5-dibromo-Nalpha-{[4-(2-oxo-1,4-dihydroquinazolin-3(2H)-yl)piperidin-1-yl]carbonyl}-D-tyrosinamide | OLCEGEPANT
TypeSmall organic molecule
Emp. Form.C38H47Br2N9O5
Mol. Mass.869.645
SMILESNCCCC[C@H](NC(=O)[C@@H](Cc1cc(Br)c(O)c(Br)c1)NC(=O)N1CCC(CC1)N1Cc2ccccc2NC1=O)C(=O)N1CCN(CC1)c1ccncc1