Reaction Details
TargetCalcitonin gene-related peptide type 1 receptor
LigandBDBM50388882
Substrate/Competitorn/a
Meas. Tech.ChEMBL_830950 (CHEMBL2065550)
Ki 0.07±n/a nM
Citation Luo, GChen, LConway, CMDenton, RKeavy, DGulianello, MHuang, YKostich, WLentz, KAMercer, SESchartman, RSignor, LBrowning, MMacor, JEDubowchik, GM Discovery of BMS-846372, a Potent and Orally Active Human CGRP Receptor Antagonist for the Treatment of Migraine. ACS Med Chem Lett3:337-341 (2012) 
 
Calcitonin gene-related peptide type 1 receptor
Name:Calcitonin gene-related peptide type 1 receptor
Type:Enzyme Catalytic Domain
Mol. Mass.:52980.45
Organism:Homo sapiens (Human)
Description:Q16602
Residue:461
BDBM50388882
NameBDBM50388882
Synonyms:CHEMBL2063115
TypeSmall organic molecule
Emp. Form.C28H27F2N5O3
Mol. Mass.519.5425
SMILESFc1cccc([C@@H]2CC[C@@H](OC(=O)N3CCC(CC3)n3c4cccnc4[nH]c3=O)c3ncccc3C2)c1F