Reaction Details
TargetCannabinoid receptor 1
LigandBDBM50388883
Substrate/Competitorn/a
Meas. Tech.ChEMBL_830976 (CHEMBL2065576)
Ki 4.5±n/a nM
Citation Dow, RLCarpino, PAGautreau, DHadcock, JRIredale, PAKelly-Sullivan, DLizano, JSSchneider, SRScott, DOWard, KM Design of a Potent CB1 Receptor Antagonist Series: Potential Scaffold for Peripherally-Targeted Agents. ACS Med Chem Lett3:397-401 (2012) 
 
Cannabinoid receptor 1
Name:Cannabinoid receptor 1
Type:G Protein-Coupled Receptor (GPCR)
Mol. Mass.:52868.96
Organism:Homo sapiens (Human)
Description:P21554
Residue:472
BDBM50388883
NameBDBM50388883
Synonyms:CHEMBL2063251
TypeSmall organic molecule
Emp. Form.C24H25Cl2N3O2
Mol. Mass.458.38
SMILESCC(C)C(=O)N(C)C1CCCOc2c1nn(c2-c1ccc(Cl)cc1)-c1ccccc1Cl