Reaction Details
TargetCannabinoid receptor 2
LigandBDBM29075
Substrate/Competitorn/a
Meas. Tech.ChEMBL_830977 (CHEMBL2065577)
Ki>10000±n/a nM
Citation Dow, RLCarpino, PAGautreau, DHadcock, JRIredale, PAKelly-Sullivan, DLizano, JSSchneider, SRScott, DOWard, KM Design of a Potent CB1 Receptor Antagonist Series: Potential Scaffold for Peripherally-Targeted Agents. ACS Med Chem Lett3:397-401 (2012) 
 
Cannabinoid receptor 2
Name:Cannabinoid receptor 2
Type:G Protein-Coupled Receptor (GPCR)
Mol. Mass.:39690.94
Organism:Homo sapiens (Human)
Description:P34972
Residue:360
BDBM29075
NameBDBM29075
Synonyms:PF-514273
TypeSmall organic molecule
Emp. Form.C21H17Cl2F2N3O2
Mol. Mass.452.281
SMILESCC(F)(F)CN1CCOc2c(nn(c2-c2ccc(Cl)cc2)-c2ccccc2Cl)C1=O