Reaction Details
TargetCannabinoid receptor 2
LigandBDBM50388886
Substrate/Competitorn/a
Meas. Tech.ChEMBL_830977 (CHEMBL2065577)
Ki 20600±n/a nM
Citation Dow, RLCarpino, PAGautreau, DHadcock, JRIredale, PAKelly-Sullivan, DLizano, JSSchneider, SRScott, DOWard, KM Design of a Potent CB1 Receptor Antagonist Series: Potential Scaffold for Peripherally-Targeted Agents. ACS Med Chem Lett3:397-401 (2012) 
 
Cannabinoid receptor 2
Name:Cannabinoid receptor 2
Type:G Protein-Coupled Receptor (GPCR)
Mol. Mass.:39690.94
Organism:Homo sapiens (Human)
Description:P34972
Residue:360
BDBM50388886
NameBDBM50388886
Synonyms:CHEMBL2063122
TypeSmall organic molecule
Emp. Form.C21H19Cl2N3O2
Mol. Mass.416.3
SMILESCC(=O)NC1CCCOc2c1nn(c2-c1ccc(Cl)cc1)-c1ccccc1Cl