Reaction Details
TargetHistone deacetylase 1
LigandBDBM50388926
Substrate/Competitorn/a
Meas. Tech.ChEMBL_831142 (CHEMBL2065955)
Ki 49±n/a nM
Citation Vickers, CJOlsen, CALeman, LJGhadiri, MR Discovery of HDAC Inhibitors That Lack an Active Site Zn(2+)-Binding Functional Group. ACS Med Chem Lett3:505-508 (2012) 
 
Histone deacetylase 1
Name:Histone deacetylase 1
Type:Enzyme
Mol. Mass.:55090.27
Organism:Homo sapiens (Human)
Description:Q13547
Residue:482
BDBM50388926
NameBDBM50388926
Synonyms:CHEMBL2063395
TypeSmall organic molecule
Emp. Form.C26H37N5O4
Mol. Mass.483.6031
SMILESCCC[C@@H]1NC(=O)[C@H](C)NC(=O)C[C@H](CC(C)C)NC(=O)[C@H](Cc2c[nH]c3ccccc23)NC1=O