Reaction Details
TargetBcl-2-like protein 1
LigandBDBM50388992
Substrate/Competitorn/a
Meas. Tech.ChEMBL_832858 (CHEMBL2066620)
Ki 1.7±n/a nM
Citation Zhou, HChen, JMeagher, JLYang, CYAguilar, ALiu, LBai, LCong, XCai, QFang, XStuckey, JAWang, S Design of Bcl-2 and Bcl-xL inhibitors with subnanomolar binding affinities based upon a new scaffold. J Med Chem55:4664-82 (2012) 
 
Bcl-2-like protein 1
Name:Bcl-2-like protein 1
Type:Mitochondrion membrane; Single-pass membrane protein
Mol. Mass.:26039.60
Organism:Homo sapiens (Human)
Description:n/a
Residue:233
BDBM50388992
NameBDBM50388992
Synonyms:CHEMBL2063895
TypeSmall organic molecule
Emp. Form.C48H52ClN7O6S2
Mol. Mass.922.553
SMILESCCOC(=O)c1c(c(cn1C)-c1ccc(Cl)cc1)-c1cccc(c1)N1CCN(CC1)c1ccc(NS(=O)(=O)c2ccc(N[C@H](CCN(C)C)CSc3ccccc3)c(c2)[N+]([O-])=O)cc1