Reaction Details
TargetPhosphatidylinositol 4,5-bisphosphate 3-kinase catalytic subunit beta isoform
LigandBDBM50389067
Substrate/Competitorn/a
Meas. Tech.ChEMBL_833165 (CHEMBL2067456)
IC50 10±n/a nM
Citation Certal, VHalley, FVirone-Oddos, ADelorme, CKarlsson, ARak, AThompson, FFiloche-Rommé, BEl-Ahmad, YCarry, JCAbecassis, PYLejeune, PVincent, LBonnevaux, HNicolas, JPBertrand, TMarquette, JPMichot, NBenard, TBelow, PVade, IChatreaux, FLebourg, GPilorge, FAngouillant-Boniface, OLouboutin, ALengauer, CSchio, L Discovery and optimization of new benzimidazole- and benzoxazole-pyrimidone selective PI3Kß inhibitors for the treatment of phosphatase and TENsin homologue (PTEN)-deficient cancers. J Med Chem55:4788-805 (2012) 
 
Phosphatidylinositol 4,5-bisphosphate 3-kinase catalytic subunit beta isoform
Name:Phosphatidylinositol 4,5-bisphosphate 3-kinase catalytic subunit beta isoform
Type:Enzyme Subunit
Mol. Mass.:122769.00
Organism:Homo sapiens (Human)
Description:P42338
Residue:1070
BDBM50389067
NameBDBM50389067
Synonyms:CHEMBL2064346
TypeSmall organic molecule
Emp. Form.C22H21N5O2
Mol. Mass.387.4344
SMILESO=c1cc(nc(Cc2nc3c(cccc3[nH]2)-c2ccccc2)[nH]1)N1CCOCC1