Reaction Details
TargetCasein kinase I isoform epsilon
LigandBDBM50389080
Substrate/Competitorn/a
Meas. Tech.ChEMBL_833717 (CHEMBL2066816)
IC50 60000±n/a nM
Citation Lo Monte, FKramer, TGu, JAnumala, URMarinelli, LLa Pietra, VNovellino, EFranco, BDemedts, DVan Leuven, FFuertes, ADominguez, JMPlotkin, BEldar-Finkelman, HSchmidt, B Identification of glycogen synthase kinase-3 inhibitors with a selective sting for glycogen synthase kinase-3a. J Med Chem55:4407-24 (2012) 
 
Casein kinase I isoform epsilon
Name:Casein kinase I isoform epsilon
Type:Protein
Mol. Mass.:47340.25
Organism:Homo sapiens (Human)
Description:P49674
Residue:416
BDBM50389080
NameBDBM50389080
Synonyms:CHEMBL2064515
TypeSmall organic molecule
Emp. Form.C23H15N3O3S
Mol. Mass.413.449
SMILESN#Cc1ccc(cc1)-c1ccc(CSc2nnc(o2)-c2ccc3OCOc3c2)cc1