Reaction Details
TargetCasein kinase I isoform epsilon
LigandBDBM50389084
Substrate/Competitorn/a
Meas. Tech.ChEMBL_833717 (CHEMBL2066816)
IC50>100000±n/a nM
Citation Lo Monte, FKramer, TGu, JAnumala, URMarinelli, LLa Pietra, VNovellino, EFranco, BDemedts, DVan Leuven, FFuertes, ADominguez, JMPlotkin, BEldar-Finkelman, HSchmidt, B Identification of glycogen synthase kinase-3 inhibitors with a selective sting for glycogen synthase kinase-3a. J Med Chem55:4407-24 (2012) 
 
Casein kinase I isoform epsilon
Name:Casein kinase I isoform epsilon
Type:Protein
Mol. Mass.:47340.25
Organism:Homo sapiens (Human)
Description:P49674
Residue:416
BDBM50389084
NameBDBM50389084
Synonyms:CHEMBL2064538
TypeSmall organic molecule
Emp. Form.C26H21N3O4S
Mol. Mass.471.528
SMILESCOC[C@@H]1COc2ccc(cc2O1)-c1nnc(SCc2ccc(cc2)-c2ccccc2C#N)o1