Reaction Details
TargetGlycogen synthase kinase-3 beta
LigandBDBM50389085
Substrate/Competitorn/a
Meas. Tech.ChEMBL_833720 (CHEMBL2066819)
IC50 36±n/a nM
Citation Lo Monte, FKramer, TGu, JAnumala, URMarinelli, LLa Pietra, VNovellino, EFranco, BDemedts, DVan Leuven, FFuertes, ADominguez, JMPlotkin, BEldar-Finkelman, HSchmidt, B Identification of glycogen synthase kinase-3 inhibitors with a selective sting for glycogen synthase kinase-3a. J Med Chem55:4407-24 (2012) 
 
Glycogen synthase kinase-3 beta
Name:Glycogen synthase kinase-3 beta
Type:Enzyme
Mol. Mass.:46756.38
Organism:Homo sapiens (Human)
Description:P49841
Residue:420
BDBM50389085
NameBDBM50389085
Synonyms:CHEMBL2064520
TypeSmall organic molecule
Emp. Form.C19H16N2O5S
Mol. Mass.384.406
SMILESCOC(=O)c1ccc(CSc2nnc(o2)-c2ccc3OCCOc3c2)cc1