Reaction Details
TargetGlycogen synthase kinase-3 beta
LigandBDBM69279
Substrate/Competitorn/a
Meas. Tech.ChEMBL_833720 (CHEMBL2066819)
IC50 10000±n/a nM
Citation Lo Monte, FKramer, TGu, JAnumala, URMarinelli, LLa Pietra, VNovellino, EFranco, BDemedts, DVan Leuven, FFuertes, ADominguez, JMPlotkin, BEldar-Finkelman, HSchmidt, B Identification of glycogen synthase kinase-3 inhibitors with a selective sting for glycogen synthase kinase-3a. J Med Chem55:4407-24 (2012) 
 
Glycogen synthase kinase-3 beta
Name:Glycogen synthase kinase-3 beta
Type:Enzyme
Mol. Mass.:46756.38
Organism:Homo sapiens (Human)
Description:P49841
Residue:420
BDBM69279
NameBDBM69279
Synonyms:4-[(5-pyridin-4-yl-1,3,4-oxadiazol-2-yl)sulfanylmethyl]benzenecarbonitrile 4-[[(5-pyridin-4-yl-1,3,4-oxadiazol-2-yl)thio]methyl]benzonitrile MLS000687325 cid_1467927
TypeSmall organic molecule
Emp. Form.C15H10N4OS
Mol. Mass.294.331
SMILESN#Cc1ccc(CSc2nnc(o2)-c2ccncc2)cc1