Reaction Details
TargetGlycogen synthase kinase-3 beta
LigandBDBM8548
Substrate/Competitorn/a
Meas. Tech.ChEMBL_833720 (CHEMBL2066819)
IC50 1318±n/a nM
Citation Lo Monte, FKramer, TGu, JAnumala, URMarinelli, LLa Pietra, VNovellino, EFranco, BDemedts, DVan Leuven, FFuertes, ADominguez, JMPlotkin, BEldar-Finkelman, HSchmidt, B Identification of glycogen synthase kinase-3 inhibitors with a selective sting for glycogen synthase kinase-3a. J Med Chem55:4407-24 (2012) 
 
Glycogen synthase kinase-3 beta
Name:Glycogen synthase kinase-3 beta
Type:Enzyme
Mol. Mass.:46756.38
Organism:Homo sapiens (Human)
Description:P49841
Residue:420
BDBM8548
NameBDBM8548
Synonyms:2-(benzylsulfanyl)-5-(pyridin-4-yl)-1,3,4-oxadiazole oxadiazole-pyridyl containing compound 8
TypeSmall organic molecule
Emp. Form.C14H11N3OS
Mol. Mass.269.322
SMILESC(Sc1nnc(o1)-c1ccncc1)c1ccccc1