Reaction Details
TargetGlycogen synthase kinase-3 beta
LigandBDBM50389078
Substrate/Competitorn/a
Meas. Tech.ChEMBL_833720 (CHEMBL2066819)
IC50 233±n/a nM
Citation Lo Monte, FKramer, TGu, JAnumala, URMarinelli, LLa Pietra, VNovellino, EFranco, BDemedts, DVan Leuven, FFuertes, ADominguez, JMPlotkin, BEldar-Finkelman, HSchmidt, B Identification of glycogen synthase kinase-3 inhibitors with a selective sting for glycogen synthase kinase-3a. J Med Chem55:4407-24 (2012) 
 
Glycogen synthase kinase-3 beta
Name:Glycogen synthase kinase-3 beta
Type:Enzyme
Mol. Mass.:46756.38
Organism:Homo sapiens (Human)
Description:P49841
Residue:420
BDBM50389078
NameBDBM50389078
Synonyms:CHEMBL2064539
TypeSmall organic molecule
Emp. Form.C26H21N3O4S
Mol. Mass.471.528
SMILESCOC[C@H]1COc2ccc(cc2O1)-c1nnc(SCc2ccc(cc2)-c2ccccc2C#N)o1