Reaction Details
TargetGlycogen synthase kinase-3 alpha
LigandBDBM50389092
Substrate/Competitorn/a
Meas. Tech.ChEMBL_833721 (CHEMBL2066820)
IC50 3206±n/a nM
Citation Lo Monte, FKramer, TGu, JAnumala, URMarinelli, LLa Pietra, VNovellino, EFranco, BDemedts, DVan Leuven, FFuertes, ADominguez, JMPlotkin, BEldar-Finkelman, HSchmidt, B Identification of glycogen synthase kinase-3 inhibitors with a selective sting for glycogen synthase kinase-3a. J Med Chem55:4407-24 (2012) 
 
Glycogen synthase kinase-3 alpha
Name:Glycogen synthase kinase-3 alpha
Type:Enzyme
Mol. Mass.:50991.79
Organism:Homo sapiens (Human)
Description:P49840
Residue:483
BDBM50389092
NameBDBM50389092
Synonyms:CHEMBL2064521
TypeSmall organic molecule
Emp. Form.C15H10N4OS
Mol. Mass.294.331
SMILESN#Cc1cccc(CSc2nnc(o2)-c2ccncc2)c1