Reaction Details
TargetGlycogen synthase kinase-3 alpha
LigandBDBM50389083
Substrate/Competitorn/a
Meas. Tech.ChEMBL_833721 (CHEMBL2066820)
IC50 2±n/a nM
Citation Lo Monte, FKramer, TGu, JAnumala, URMarinelli, LLa Pietra, VNovellino, EFranco, BDemedts, DVan Leuven, FFuertes, ADominguez, JMPlotkin, BEldar-Finkelman, HSchmidt, B Identification of glycogen synthase kinase-3 inhibitors with a selective sting for glycogen synthase kinase-3a. J Med Chem55:4407-24 (2012) 
 
Glycogen synthase kinase-3 alpha
Name:Glycogen synthase kinase-3 alpha
Type:Enzyme
Mol. Mass.:50991.79
Organism:Homo sapiens (Human)
Description:P49840
Residue:483
BDBM50389083
NameBDBM50389083
Synonyms:CHEMBL2064535
TypeSmall organic molecule
Emp. Form.C24H16FN3O3S
Mol. Mass.445.466
SMILESFc1ccc(-c2ccc(CSc3nnc(o3)-c3ccc4OCCOc4c3)cc2)c(c1)C#N