Reaction Details
TargetAurora kinase B
LigandBDBM50389262
Substrate/Competitorn/a
Meas. Tech.ChEMBL_831558 (CHEMBL2064921)
IC50 0.900000±n/a nM
Citation Ji, ZDai, YAbad-Zapatero, CAlbert, DHBouska, JJGlaser, KBMarcotte, PASoni, NBMagoc, TJStewart, KDWei, RQDavidsen, SKMichaelides, MR Exploration of diverse hinge-binding scaffolds for selective Aurora kinase inhibitors. Bioorg Med Chem Lett22:4528-31 (2012) 
 
Aurora kinase B
Name:Aurora kinase B
Type:Protein
Mol. Mass.:39327.72
Organism:Homo sapiens (Human)
Description:Q96GD4
Residue:344
BDBM50389262
NameBDBM50389262
Synonyms:CHEMBL2063459
TypeSmall organic molecule
Emp. Form.C21H18ClN7O2
Mol. Mass.435.866
SMILESNc1ncnn2ccc(C(=O)Nc3cccc(CNC(=O)Nc4ccc(Cl)cc4)c3)c12