Reaction Details
TargetAurora kinase A
LigandBDBM50389238
Substrate/Competitorn/a
Meas. Tech.ChEMBL_831557 (CHEMBL2064920)
IC50 786±n/a nM
Citation Ji, ZDai, YAbad-Zapatero, CAlbert, DHBouska, JJGlaser, KBMarcotte, PASoni, NBMagoc, TJStewart, KDWei, RQDavidsen, SKMichaelides, MR Exploration of diverse hinge-binding scaffolds for selective Aurora kinase inhibitors. Bioorg Med Chem Lett22:4528-31 (2012) 
 
Aurora kinase A
Name:Aurora kinase A
Type:Serine/threonine-protein kinase
Mol. Mass.:45830.98
Organism:Homo sapiens (Human)
Description:O14965
Residue:403
BDBM50389238
NameBDBM50389238
Synonyms:CHEMBL2063460
TypeSmall organic molecule
Emp. Form.C22H18F3N7O2
Mol. Mass.469.4192
SMILESNc1ncnn2ccc(C(=O)Nc3cccc(CNC(=O)Nc4ccc(cc4)C(F)(F)F)c3)c12