Reaction Details
TargetAurora kinase A
LigandBDBM50389246
Substrate/Competitorn/a
Meas. Tech.ChEMBL_831557 (CHEMBL2064920)
IC50 586±n/a nM
Citation Ji, ZDai, YAbad-Zapatero, CAlbert, DHBouska, JJGlaser, KBMarcotte, PASoni, NBMagoc, TJStewart, KDWei, RQDavidsen, SKMichaelides, MR Exploration of diverse hinge-binding scaffolds for selective Aurora kinase inhibitors. Bioorg Med Chem Lett22:4528-31 (2012) 
 
Aurora kinase A
Name:Aurora kinase A
Type:Serine/threonine-protein kinase
Mol. Mass.:45830.98
Organism:Homo sapiens (Human)
Description:O14965
Residue:403
BDBM50389246
NameBDBM50389246
Synonyms:CHEMBL2063443
TypeSmall organic molecule
Emp. Form.C23H21N5O3
Mol. Mass.415.4445
SMILESCc1ccc(NC(=O)NCc2cccc(NC(=O)c3cccc4onc(N)c34)c2)cc1