Reaction Details
TargetInterleukin-1 receptor-associated kinase 4
LigandBDBM50389241
Substrate/Competitorn/a
Meas. Tech.ChEMBL_831571 (CHEMBL2064934)
IC50 340±n/a nM
Citation Ji, ZDai, YAbad-Zapatero, CAlbert, DHBouska, JJGlaser, KBMarcotte, PASoni, NBMagoc, TJStewart, KDWei, RQDavidsen, SKMichaelides, MR Exploration of diverse hinge-binding scaffolds for selective Aurora kinase inhibitors. Bioorg Med Chem Lett22:4528-31 (2012) 
 
Interleukin-1 receptor-associated kinase 4
Name:Interleukin-1 receptor-associated kinase 4
Type:Protein
Mol. Mass.:51519.08
Organism:Homo sapiens (Human)
Description:Q9NWZ3
Residue:460
BDBM50389241
NameBDBM50389241
Synonyms:CHEMBL1990583
TypeSmall organic molecule
Emp. Form.C20H16FN7O2
Mol. Mass.405.3851
SMILESNc1ncnn2ccc(C(=O)Nc3ccc(NC(=O)Nc4cccc(F)c4)cc3)c12