Reaction Details
TargetSodium/glucose cotransporter 1
LigandBDBM50389346
Substrate/Competitorn/a
Meas. Tech.ChEMBL_831838 (CHEMBL2065402)
EC50 23063±n/a nM
Citation Yao, CHSong, JSChen, CTYeh, TKHsieh, TCWu, SHHuang, CYHuang, YLWang, MHLiu, YWTsai, CHKumar, CRLee, JC Synthesis and biological evaluation of novel C-indolylxylosides as sodium-dependent glucose co-transporter 2 inhibitors. Eur J Med Chem55:32-8 (2012) 
 
Sodium/glucose cotransporter 1
Name:Sodium/glucose cotransporter 1
Type:Protein
Mol. Mass.:73503.78
Organism:Homo sapiens (Human)
Description:P13866
Residue:664
BDBM50389346
NameBDBM50389346
Synonyms:CHEMBL2062542
TypeSmall organic molecule
Emp. Form.C24H29NO4
Mol. Mass.395.4914
SMILESCC(C)(C)c1ccc(Cn2cc([C@@H]3OC[C@@H](O)[C@H](O)[C@H]3O)c3ccccc23)cc1