Reaction Details
TargetSodium/glucose cotransporter 1
LigandBDBM50335145
Substrate/Competitorn/a
Meas. Tech.ChEMBL_831838 (CHEMBL2065402)
EC50 364±n/a nM
Citation Yao, CHSong, JSChen, CTYeh, TKHsieh, TCWu, SHHuang, CYHuang, YLWang, MHLiu, YWTsai, CHKumar, CRLee, JC Synthesis and biological evaluation of novel C-indolylxylosides as sodium-dependent glucose co-transporter 2 inhibitors. Eur J Med Chem55:32-8 (2012) 
 
Sodium/glucose cotransporter 1
Name:Sodium/glucose cotransporter 1
Type:Protein
Mol. Mass.:73503.78
Organism:Homo sapiens (Human)
Description:P13866
Residue:664
BDBM50335145
NameBDBM50335145
Synonyms:4-Chloro-3-(4-cyclopropylbenzyl)-1-(beta-D-xylopyranosyl)-1Hindole | CHEMBL1650501
TypeSmall organic molecule
Emp. Form.C23H24ClNO4
Mol. Mass.413.894
SMILESO[C@@H]1CO[C@H]([C@H](O)[C@H]1O)n1cc(Cc2ccc(cc2)C2CC2)c2c(Cl)cccc12