Reaction Details
TargetAcetylcholinesterase
LigandBDBM50389380
Substrate/Competitorn/a
Meas. Tech.ChEMBL_831935 (CHEMBL2066009)
Ki 10.3±n/a nM
Citation Hamulakova, SJanovec, LHrabinova, MKristian, PKuca, KBanasova, MImrich, J Synthesis, design and biological evaluation of novel highly potent tacrine congeners for the treatment of Alzheimer's disease. Eur J Med Chem55:23-31 (2012) 
 
Acetylcholinesterase
Name:Acetylcholinesterase
Type:Enzyme
Mol. Mass.:67792.70
Organism:Homo sapiens (Human)
Description:P22303
Residue:614
BDBM50389380
NameBDBM50389380
Synonyms:CHEMBL2064468
TypeSmall organic molecule
Emp. Form.C29H45N5
Mol. Mass.463.7011
SMILESCN(CCCN1CCN(CCNc2c3CCCCc3nc3ccccc23)CC1)C1CCCCC1