Reaction Details
TargetAcetylcholinesterase
LigandBDBM50389381
Substrate/Competitorn/a
Meas. Tech.ChEMBL_831932 (CHEMBL2066006)
IC50 70.3±n/a nM
Citation Hamulakova, SJanovec, LHrabinova, MKristian, PKuca, KBanasova, MImrich, J Synthesis, design and biological evaluation of novel highly potent tacrine congeners for the treatment of Alzheimer's disease. Eur J Med Chem55:23-31 (2012) 
 
Acetylcholinesterase
Name:Acetylcholinesterase
Type:Enzyme
Mol. Mass.:67792.70
Organism:Homo sapiens (Human)
Description:P22303
Residue:614
BDBM50389381
NameBDBM50389381
Synonyms:CHEMBL2064466
TypeSmall organic molecule
Emp. Form.C29H37N5O
Mol. Mass.471.637
SMILESCN(CCC(=O)N1CCN(CCNc2c3CCCCc3nc3ccccc23)CC1)c1ccccc1