Reaction Details
TargetAcetylcholinesterase
LigandBDBM50389384
Substrate/Competitorn/a
Meas. Tech.ChEMBL_831935 (CHEMBL2066009)
Ki 16.8±n/a nM
Citation Hamulakova, SJanovec, LHrabinova, MKristian, PKuca, KBanasova, MImrich, J Synthesis, design and biological evaluation of novel highly potent tacrine congeners for the treatment of Alzheimer's disease. Eur J Med Chem55:23-31 (2012) 
 
Acetylcholinesterase
Name:Acetylcholinesterase
Type:Enzyme
Mol. Mass.:67792.70
Organism:Homo sapiens (Human)
Description:P22303
Residue:614
BDBM50389384
NameBDBM50389384
Synonyms:CHEMBL2064404
TypeSmall organic molecule
Emp. Form.C27H39N5O
Mol. Mass.449.6315
SMILESO=C(CCN1CCCCC1)N1CCN(CCNc2c3CCCCc3nc3ccccc23)CC1