Reaction Details
TargetAdenosine receptor A1
LigandBDBM50389799
Substrate/Competitorn/a
Meas. Tech.ChEMBL_834566 (CHEMBL2072274)
Ki 27±n/a nM
Citation Tosh, DKPhan, KGao, ZGGakh, AAXu, FDeflorian, FAbagyan, RStevens, RCJacobson, KAKatritch, V Optimization of adenosine 5'-carboxamide derivatives as adenosine receptor agonists using structure-based ligand design and fragment screening. J Med Chem55:4297-308 (2012) 
 
Adenosine receptor A1
Name:Adenosine receptor A1
Type:G Protein-Coupled Receptor (GPCR)
Mol. Mass.:36520.92
Organism:Homo sapiens (Human)
Description:P30542
Residue:326
BDBM50389799
NameBDBM50389799
Synonyms:CHEMBL2070508
TypeSmall organic molecule
Emp. Form.C15H20N6O4
Mol. Mass.348.3571
SMILESNc1ncnc2n(cnc12)[C@@H]1O[C@@H]([C@@H](O)[C@H]1O)C(=O)NC1CCCC1