Reaction Details
TargetAdenosine receptor A2a
LigandBDBM51080
Substrate/Competitorn/a
Meas. Tech.ChEMBL_834829 (CHEMBL2073146)
Ki 1259±n/a nM
Citation Sanders, MPRoumen, Lvan der Horst, ELane, JRVischer, HFvan Offenbeek, Jde Vries, HVerhoeven, SChow, KYVerkaar, FBeukers, MWMcGuire, RLeurs, RIjzerman, APde Vlieg, Jde Esch, IJZaman, GJKlomp, JPBender, Ade Graaf, C A prospective cross-screening study on G-protein-coupled receptors: lessons learned in virtual compound library design. J Med Chem55:5311-25 (2012) 
 
Adenosine receptor A2a
Name:Adenosine receptor A2a
Type:G Protein-Coupled Receptor (GPCR)
Mol. Mass.:44716.46
Organism:Homo sapiens (Human)
Description:P29274
Residue:412
BDBM51080
NameBDBM51080
Synonyms:4-[(2Z)-2-(2-oxo-1-naphthalenylidene)hydrazinyl]-1H-imidazole-5-carboxylic acid ethyl ester MLS000705197 cid_6078945 ethyl 4-[(2Z)-2-(2-oxonaphthalen-1-ylidene)hydrazinyl]-1H-imidazole-5-carboxylate | ethyl 5-[(2-hydroxy-1-naphthyl)diazenyl]-1H-imidazole-4-carboxylate
TypeSmall organic molecule
Emp. Form.C16H14N4O3
Mol. Mass.310.3074
SMILESCCOC(=O)c1[nH]cnc1N=Nc1c(O)ccc2ccccc12