Reaction Details
TargetVascular endothelial growth factor receptor 2
LigandBDBM50389994
Substrate/Competitorn/a
Meas. Tech.ChEMBL_835008 (CHEMBL2073500)
IC50 78±n/a nM
Citation Curtin, MLHeyman, HRFrey, RRMarcotte, PAGlaser, KBJankowski, JRMagoc, TJAlbert, DHOlson, AMReuter, DRBouska, JJMontgomery, DAPalma, JPDonawho, CKStewart, KDTse, CMichaelides, MR Pyrazole diaminopyrimidines as dual inhibitors of KDR and Aurora B kinases. Bioorg Med Chem Lett22:4750-5 (2012) 
 
Vascular endothelial growth factor receptor 2
Name:Vascular endothelial growth factor receptor 2
Type:Receptor Tyrosine Kinase
Mol. Mass.:151510.97
Organism:Homo sapiens (Human)
Description:P35968
Residue:1356
BDBM50389994
NameBDBM50389994
Synonyms:CHEMBL2071274
TypeSmall organic molecule
Emp. Form.C21H27ClN8O2
Mol. Mass.458.944
SMILESNC(=O)[C@H]1[C@H]2C[C@H](C=C2)[C@H]1Nc1nc(Nc2cnn(CCN3CCOCC3)c2)ncc1Cl