Reaction Details
TargetVascular endothelial growth factor receptor 2
LigandBDBM50389973
Substrate/Competitorn/a
Meas. Tech.ChEMBL_835006 (CHEMBL2073498)
IC50 50±n/a nM
Citation Curtin, MLHeyman, HRFrey, RRMarcotte, PAGlaser, KBJankowski, JRMagoc, TJAlbert, DHOlson, AMReuter, DRBouska, JJMontgomery, DAPalma, JPDonawho, CKStewart, KDTse, CMichaelides, MR Pyrazole diaminopyrimidines as dual inhibitors of KDR and Aurora B kinases. Bioorg Med Chem Lett22:4750-5 (2012) 
 
Vascular endothelial growth factor receptor 2
Name:Vascular endothelial growth factor receptor 2
Type:Receptor Tyrosine Kinase
Mol. Mass.:151510.97
Organism:Homo sapiens (Human)
Description:P35968
Residue:1356
BDBM50389973
NameBDBM50389973
Synonyms:CHEMBL2071199
TypeSmall organic molecule
Emp. Form.C16H18N8O3
Mol. Mass.370.3659
SMILESCn1cc(Nc2ncc(c(N[C@@H]3[C@@H]4C[C@@H](C=C4)[C@@H]3C(N)=O)n2)[N+]([O-])=O)cn1