Reaction Details
TargetVascular endothelial growth factor receptor 2
LigandBDBM50389982
Substrate/Competitorn/a
Meas. Tech.ChEMBL_835008 (CHEMBL2073500)
IC50 84±n/a nM
Citation Curtin, MLHeyman, HRFrey, RRMarcotte, PAGlaser, KBJankowski, JRMagoc, TJAlbert, DHOlson, AMReuter, DRBouska, JJMontgomery, DAPalma, JPDonawho, CKStewart, KDTse, CMichaelides, MR Pyrazole diaminopyrimidines as dual inhibitors of KDR and Aurora B kinases. Bioorg Med Chem Lett22:4750-5 (2012) 
 
Vascular endothelial growth factor receptor 2
Name:Vascular endothelial growth factor receptor 2
Type:Receptor Tyrosine Kinase
Mol. Mass.:151510.97
Organism:Homo sapiens (Human)
Description:P35968
Residue:1356
BDBM50389982
NameBDBM50389982
Synonyms:CHEMBL2071210
TypeSmall organic molecule
Emp. Form.C16H20ClN7O
Mol. Mass.361.829
SMILESCn1cc(Nc2ncc(Cl)c(N[C@@H]3[C@H]4CC[C@H](C4)[C@@H]3C(N)=O)n2)cn1