Reaction Details
TargetAurora kinase B
LigandBDBM50389992
Substrate/Competitorn/a
Meas. Tech.ChEMBL_835007 (CHEMBL2073499)
IC50 25±n/a nM
Citation Curtin, MLHeyman, HRFrey, RRMarcotte, PAGlaser, KBJankowski, JRMagoc, TJAlbert, DHOlson, AMReuter, DRBouska, JJMontgomery, DAPalma, JPDonawho, CKStewart, KDTse, CMichaelides, MR Pyrazole diaminopyrimidines as dual inhibitors of KDR and Aurora B kinases. Bioorg Med Chem Lett22:4750-5 (2012) 
 
Aurora kinase B
Name:Aurora kinase B
Type:Protein
Mol. Mass.:39327.72
Organism:Homo sapiens (Human)
Description:Q96GD4
Residue:344
BDBM50389992
NameBDBM50389992
Synonyms:CHEMBL2071272
TypeSmall organic molecule
Emp. Form.C17H19ClN8O2
Mol. Mass.402.838
SMILESNC(=O)Cn1cc(Nc2ncc(Cl)c(N[C@@H]3[C@@H]4C[C@@H](C=C4)[C@@H]3C(N)=O)n2)cn1