Reaction Details
TargetAurora kinase B
LigandBDBM50389972
Substrate/Competitorn/a
Meas. Tech.ChEMBL_835007 (CHEMBL2073499)
IC50 197±n/a nM
Citation Curtin, MLHeyman, HRFrey, RRMarcotte, PAGlaser, KBJankowski, JRMagoc, TJAlbert, DHOlson, AMReuter, DRBouska, JJMontgomery, DAPalma, JPDonawho, CKStewart, KDTse, CMichaelides, MR Pyrazole diaminopyrimidines as dual inhibitors of KDR and Aurora B kinases. Bioorg Med Chem Lett22:4750-5 (2012) 
 
Aurora kinase B
Name:Aurora kinase B
Type:Protein
Mol. Mass.:39327.72
Organism:Homo sapiens (Human)
Description:Q96GD4
Residue:344
BDBM50389972
NameBDBM50389972
Synonyms:CHEMBL2071198
TypeSmall organic molecule
Emp. Form.C17H20N8O2
Mol. Mass.368.3931
SMILESCn1cc(Nc2ncc(C(N)=O)c(N[C@@H]3[C@@H]4C[C@@H](C=C4)[C@@H]3C(N)=O)n2)cn1