Reaction Details
TargetVascular endothelial growth factor receptor 2
LigandBDBM50389978
Substrate/Competitorn/a
Meas. Tech.ChEMBL_835006 (CHEMBL2073498)
IC50 264±n/a nM
Citation Curtin, MLHeyman, HRFrey, RRMarcotte, PAGlaser, KBJankowski, JRMagoc, TJAlbert, DHOlson, AMReuter, DRBouska, JJMontgomery, DAPalma, JPDonawho, CKStewart, KDTse, CMichaelides, MR Pyrazole diaminopyrimidines as dual inhibitors of KDR and Aurora B kinases. Bioorg Med Chem Lett22:4750-5 (2012) 
 
Vascular endothelial growth factor receptor 2
Name:Vascular endothelial growth factor receptor 2
Type:Receptor Tyrosine Kinase
Mol. Mass.:151510.97
Organism:Homo sapiens (Human)
Description:P35968
Residue:1356
BDBM50389978
NameBDBM50389978
Synonyms:CHEMBL2071205
TypeSmall organic molecule
Emp. Form.C19H24F3N7O
Mol. Mass.423.4354
SMILESCn1cc(Nc2ncc(c(N[C@@H]3[C@@H]4C[C@H](C[C@@H]3C(N)=O)C4(C)C)n2)C(F)(F)F)cn1