Reaction Details
TargetVascular endothelial growth factor receptor 2
LigandBDBM50389966
Substrate/Competitorn/a
Meas. Tech.ChEMBL_835006 (CHEMBL2073498)
IC50 68±n/a nM
Citation Curtin, MLHeyman, HRFrey, RRMarcotte, PAGlaser, KBJankowski, JRMagoc, TJAlbert, DHOlson, AMReuter, DRBouska, JJMontgomery, DAPalma, JPDonawho, CKStewart, KDTse, CMichaelides, MR Pyrazole diaminopyrimidines as dual inhibitors of KDR and Aurora B kinases. Bioorg Med Chem Lett22:4750-5 (2012) 
 
Vascular endothelial growth factor receptor 2
Name:Vascular endothelial growth factor receptor 2
Type:Receptor Tyrosine Kinase
Mol. Mass.:151510.97
Organism:Homo sapiens (Human)
Description:P35968
Residue:1356
BDBM50389966
NameBDBM50389966
Synonyms:CHEMBL2071206
TypeSmall organic molecule
Emp. Form.C18H20F3N7O
Mol. Mass.407.3929
SMILESCNC(=O)[C@H]1[C@H]2C[C@H](C=C2)[C@H]1Nc1nc(Nc2cnn(C)c2)ncc1C(F)(F)F