Reaction Details
TargetTyrosine-protein kinase Lck
LigandBDBM50389975
Substrate/Competitorn/a
Meas. Tech.ChEMBL_835021 (CHEMBL2073513)
IC50 7±n/a nM
Citation Curtin, MLHeyman, HRFrey, RRMarcotte, PAGlaser, KBJankowski, JRMagoc, TJAlbert, DHOlson, AMReuter, DRBouska, JJMontgomery, DAPalma, JPDonawho, CKStewart, KDTse, CMichaelides, MR Pyrazole diaminopyrimidines as dual inhibitors of KDR and Aurora B kinases. Bioorg Med Chem Lett22:4750-5 (2012) 
 
Tyrosine-protein kinase Lck
Name:Tyrosine-protein kinase Lck
Type:n/a
Mol. Mass.:57987.83
Organism:Homo sapiens (Human)
Description:P06239
Residue:509
BDBM50389975
NameBDBM50389975
Synonyms:CHEMBL2071201
TypeSmall organic molecule
Emp. Form.C16H18BrN7O
Mol. Mass.404.264
SMILESCn1cc(Nc2ncc(Br)c(N[C@@H]3[C@@H]4C[C@@H](C=C4)[C@@H]3C(N)=O)n2)cn1