Reaction Details
TargetS-methyl-5'-thioadenosine phosphorylase
LigandBDBM50390250
Substrate/Competitorn/a
Meas. Tech.ChEMBL_834947 (CHEMBL2073357)
Ki 602±n/a nM
Citation Clinch, KEvans, GBFröhlich, RFGulab, SAGutierrez, JAMason, JMSchramm, VLTyler, PCWoolhouse, AD Transition state analogue inhibitors of human methylthioadenosine phosphorylase and bacterial methylthioadenosine/S-adenosylhomocysteine nucleosidase incorporating acyclic ribooxacarbenium ion mimics. Bioorg Med Chem20:5181-7 (2012) 
 
S-methyl-5'-thioadenosine phosphorylase
Name:S-methyl-5'-thioadenosine phosphorylase
Type:Enzyme
Mol. Mass.:31239.23
Organism:Homo sapiens (Human)
Description:n/a
Residue:283
BDBM50390250
NameBDBM50390250
Synonyms:CHEMBL2070403
TypeSmall organic molecule
Emp. Form.C11H17N5OS
Mol. Mass.267.351
SMILESCSC[C@@H](O)CNCc1c[nH]c2c(N)ncnc12