Reaction Details
TargetHigh affinity cAMP-specific and IBMX-insensitive 3',5'-cyclic phosphodiesterase 8B
LigandBDBM50390332
Substrate/Competitorn/a
Meas. Tech.ChEMBL_835072 (CHEMBL2073616)
IC50 1.6±n/a nM
Citation DeNinno, MPWright, SWEtienne, JBOlson, TVRocke, BNCorbett, JWKung, DWDiRico, KJAndrews, KMMillham, MLParker, JCEsler, Wvan Volkenburg, MBoyer, DDHouseknecht, KLDoran, SD Discovery of triazolopyrimidine-based PDE8B inhibitors: exceptionally ligand-efficient and lipophilic ligand-efficient compounds for the treatment of diabetes. Bioorg Med Chem Lett22:5721-6 (2012) 
 
High affinity cAMP-specific and IBMX-insensitive 3',5'-cyclic phosphodiesterase 8B
Name:High affinity cAMP-specific and IBMX-insensitive 3',5'-cyclic phosphodiesterase 8B
Type:PROTEIN
Mol. Mass.:98984.88
Organism:Homo sapiens (Human)
Description:ChEMBL_876321
Residue:885
BDBM50390332
NameBDBM50390332
Synonyms:CHEMBL2070732
TypeSmall organic molecule
Emp. Form.C16H17F3N8O
Mol. Mass.394.3544
SMILESNc1nc(nc2n(C[C@H]3CN(Cc4ccccn4)CCO3)nnc12)C(F)(F)F