Reaction Details
TargetHigh affinity cAMP-specific and IBMX-insensitive 3',5'-cyclic phosphodiesterase 8B
LigandBDBM50390352
Substrate/Competitorn/a
Meas. Tech.ChEMBL_835072 (CHEMBL2073616)
IC50 12.1±n/a nM
Citation DeNinno, MPWright, SWEtienne, JBOlson, TVRocke, BNCorbett, JWKung, DWDiRico, KJAndrews, KMMillham, MLParker, JCEsler, Wvan Volkenburg, MBoyer, DDHouseknecht, KLDoran, SD Discovery of triazolopyrimidine-based PDE8B inhibitors: exceptionally ligand-efficient and lipophilic ligand-efficient compounds for the treatment of diabetes. Bioorg Med Chem Lett22:5721-6 (2012) 
 
High affinity cAMP-specific and IBMX-insensitive 3',5'-cyclic phosphodiesterase 8B
Name:High affinity cAMP-specific and IBMX-insensitive 3',5'-cyclic phosphodiesterase 8B
Type:PROTEIN
Mol. Mass.:98984.88
Organism:Homo sapiens (Human)
Description:ChEMBL_876321
Residue:885
BDBM50390352
NameBDBM50390352
Synonyms:CHEMBL2070901
TypeSmall organic molecule
Emp. Form.C17H20N6OS
Mol. Mass.356.445
SMILESNc1nc(CSc2ccccc2)nc2n(CC3CCCCO3)nnc12