Reaction Details
TargetTransient receptor potential cation channel subfamily A member 1
LigandBDBM50390485
Substrate/Competitorn/a
Meas. Tech.ChEMBL_835269 (CHEMBL2071975)
IC50 10±n/a nM
Citation Vallin, KSSterky, KJNyman, EBernström, JFrom, RLinde, CMinidis, ABNolting, ANärhi, KSantangelo, EMSehgelmeble, FWSohn, DStrindlund, JWeigelt, D N-1-Alkyl-2-oxo-2-aryl amides as novel antagonists of the TRPA1 receptor. Bioorg Med Chem Lett22:5485-92 (2012) 
 
Transient receptor potential cation channel subfamily A member 1
Name:Transient receptor potential cation channel subfamily A member 1
Type:Protein
Mol. Mass.:127514.20
Organism:Homo sapiens (Human)
Description:O75762
Residue:1119
BDBM50390485
NameBDBM50390485
Synonyms:CHEMBL2071601
TypeSmall organic molecule
Emp. Form.C19H16ClF3N2O4
Mol. Mass.428.79
SMILESCC(C)C(NC(=O)c1cc(Cl)ccc1C(F)(F)F)C(=O)c1ccc(cc1)[N+]([O-])=O