Reaction Details
TargetReceptor tyrosine-protein kinase erbB-2
LigandBDBM50390489
Substrate/Competitorn/a
Meas. Tech.ChEMBL_835275 (CHEMBL2071981)
Ki 3100±n/a nM
Citation Sicard, RDhuguru, JLiu, WPatel, NLandgraf, RWilson, JN A fluorescent reporter of ATP binding-competent receptor kinases. Bioorg Med Chem Lett22:5532-5 (2012) 
 
Receptor tyrosine-protein kinase erbB-2
Name:Receptor tyrosine-protein kinase erbB-2
Type:n/a
Mol. Mass.:137894.47
Organism:Homo sapiens (Human)
Description:P04626
Residue:1255
BDBM50390489
NameBDBM50390489
Synonyms:CHEMBL2071602
TypeSmall organic molecule
Emp. Form.C25H24N4
Mol. Mass.380.4849
SMILESCN(C)c1ccc(\C=C\c2ccc3ncnc(NCc4ccccc4)c3c2)cc1