Reaction Details
TargetCarbonic anhydrase 1
LigandBDBM50337278
Substrate/Competitorn/a
Meas. Tech.ChEMBL_835654 (CHEMBL2071765)
Ki 1200±n/a nM
Citation Sechi, MInnocenti, APala, NRogolino, DCarcelli, MScozzafava, ASupuran, CT Inhibition ofa-class cytosolic human carbonic anhydrases I, II, IX and XII, andß-class fungal enzymes by carboxylic acids and their derivatives: new isoform-I selective nanomolar inhibitors. Bioorg Med Chem Lett22:5801-6 (2012) 
 
Carbonic anhydrase 1
Name:Carbonic anhydrase 1
Type:Enzyme
Mol. Mass.:28873.37
Organism:Homo sapiens (Human)
Description:P00915
Residue:261
BDBM50337278
NameBDBM50337278
Synonyms:2-(phenylamino)benzoic acid CHEMBL23832 US9271961, 2 | phenylanthranilic acid
TypeSmall organic molecule
Emp. Form.C13H11NO2
Mol. Mass.213.2319
SMILESOC(=O)c1ccccc1Nc1ccccc1