Reaction Details
TargetDual specificity testis-specific protein kinase 2
LigandBDBM50390794
Substrate/Competitorn/a
Meas. Tech.ChEMBL_835732 (CHEMBL2071843)
IC50>30000±n/a nM
Citation He, LSeitz, SPTrainor, GLTortolani, DVaccaro, WPoss, MTarby, CMTokarski, JSPenhallow, BHung, CYAttar, RLin, TA Modulation of cofilin phosphorylation by inhibition of the Lim family kinases. Bioorg Med Chem Lett22:5995-8 (2012) 
 
Dual specificity testis-specific protein kinase 2
Name:Dual specificity testis-specific protein kinase 2
Type:PROTEIN
Mol. Mass.:63642.30
Organism:Homo sapiens (Human)
Description:ChEMBL_835732
Residue:571
BDBM50390794
NameBDBM50390794
Synonyms:CHEMBL2070618
TypeSmall organic molecule
Emp. Form.C20H15Cl2N7O2S
Mol. Mass.488.35
SMILESCNC(=O)Nc1ncc(s1)-c1cc(nc(n1)-c1cnccn1)-c1c(Cl)cc(OC)cc1Cl