Reaction Details
TargetPotassium voltage-gated channel subfamily KQT member 1
LigandBDBM50390894
Substrate/Competitorn/a
Meas. Tech.ChEMBL_835825 (CHEMBL2071936)
EC50 4380±n/a nM
Citation Mattmann, MEYu, HLin, ZXu, KHuang, XLong, SWu, MMcManus, OBEngers, DWLe, UMLi, MLindsley, CWHopkins, CR Identification of (R)-N-(4-(4-methoxyphenyl)thiazol-2-yl)-1-tosylpiperidine-2-carboxamide, ML277, as a novel, potent and selective K(v)7.1 (KCNQ1) potassium channel activator. Bioorg Med Chem Lett22:5936-41 (2012) 
 
Potassium voltage-gated channel subfamily KQT member 1
Name:Potassium voltage-gated channel subfamily KQT member 1
Type:PROTEIN
Mol. Mass.:74739.00
Organism:Homo sapiens (Human)
Description:ChEMBL_1454245
Residue:676
BDBM50390894
NameBDBM50390894
Synonyms:CHEMBL2070987
TypeSmall organic molecule
Emp. Form.C22H23N3O5S2
Mol. Mass.473.565
SMILESCOc1ccc(cc1)-c1csc(NC(=O)C2COCCN2S(=O)(=O)c2ccc(C)cc2)n1