Reaction Details
TargetSolute carrier organic anion transporter family member 2A1
LigandBDBM50390997
Substrate/Competitorn/a
Meas. Tech.ChEMBL_836140 (CHEMBL2077576)
Ki 71.2±n/a nM
Citation Itoh, SLu, RBao, YMorrow, JDRoberts, LJSchuster, VL Structural determinants of substrates for the prostaglandin transporter PGT. Mol Pharmacol50:738-42 (1996) Solute carrier organic anion transporter family member 2A1
Name:Solute carrier organic anion transporter family member 2A1
Type:Protein
Mol. Mass.:70404.97
Organism:Rattus norvegicus (Rat)
Description:Q00910
Residue:644
BDBM50390997
NameBDBM50390997
Synonyms:CHEMBL1561148
TypeSmall organic molecule
Emp. Form.C20H32O4
Mol. Mass.336.4657
SMILESCCCCC[C@H](O)C=CC1=C(CCCCCCC(O)=O)C(=O)CC1