Reaction Details
TargetSolute carrier family 22 member 6
LigandBDBM50139896
Substrate/Competitorn/a
Meas. Tech.ChEMBL_835925 (CHEMBL2077063)
Ki 2310000±n/a nM
Citation Jariyawat, SSekine, TTakeda, MApiwattanakul, NKanai, YSophasan, SEndou, H The interaction and transport of beta-lactam antibiotics with the cloned rat renal organic anion transporter 1. J Pharmacol Exp Ther290:672-7 (1999) Solute carrier family 22 member 6
Name:Solute carrier family 22 member 6
Type:PROTEIN
Mol. Mass.:60784.17
Organism:Rattus norvegicus
Description:ChEMBL_838479
Residue:551
BDBM50139896
NameBDBM50139896
Synonyms:(6R,7R)-7-((R)-2-Amino-2-phenyl-acetylamino)-3-methyl-8-oxo-5-thia-1-aza-bicyclo[4.2.0]oct-2-ene-2-carboxylic acid CEPHALEXIN KEFLET KEFTAB
TypeSmall organic molecule
Emp. Form.C16H17N3O4S
Mol. Mass.347.389
SMILESCC1=C(N2[C@H](SC1)[C@H](NC(=O)[C@H](N)c1ccccc1)C2=O)C(O)=O