Reaction Details
TargetC-C chemokine receptor type 2
LigandBDBM50391024
Substrate/Competitorn/a
Meas. Tech.ChEMBL_840426 (CHEMBL2089603)
IC50 1.9±n/a nM
Citation Cherney, RJMo, RMeyer, DTPechulis, ADGuaciaro, MALo, YCYang, GMiller, PBScherle, PAZhao, QCvijic, MEBarrish, JCDecicco, CPCarter, PH Benzimidazoles as benzamide replacements within cyclohexane-based CC chemokine receptor 2 (CCR2) antagonists. Bioorg Med Chem Lett22:6181-4 (2012) 
 
C-C chemokine receptor type 2
Name:C-C chemokine receptor type 2
Type:Enzyme
Mol. Mass.:41932.32
Organism:Homo sapiens (Human)
Description:P41597
Residue:374
BDBM50391024
NameBDBM50391024
Synonyms:CHEMBL2088389
TypeSmall organic molecule
Emp. Form.C30H37F3N4O3S
Mol. Mass.590.7
SMILESCCN(C(C)C)[C@@H]1CC[C@@H]([C@H](CS(=O)(=O)c2ccccc2)C1)N1CCC(C1=O)c1nc2cccc(c2[nH]1)C(F)(F)F